Reaction Details
TargetHeat shock cognate 71 kDa protein
LigandBDBM31745
Substrate/Competitorn/a
Meas. Tech.In Vitro Hsc70 Dose Response Fluorescence Polarization Assay
IC50 115000±4440 nM
Citation PubChem, PC In Vitro Hsc70 Dose Response Fluorescence Polarization Assay PubChem Bioassay(2008)[AID]
 
Heat shock cognate 71 kDa protein
Name:Heat shock cognate 71 kDa protein
Type:Enzyme Catalytic Domain
Mol. Mass.:70887.67
Organism:Homo sapiens (Human)
Description:gi_5729877
Residue:646
BDBM31745
NameBDBM31745
Synonyms:8-(2-carbomethoxyphenoxy)carbonyl-3a,4,5,9b-tetrahydro-3H-cyclopenta[c]quinoline-4-carboxylic acid 8-[(2-methoxycarbonylphenoxy)-oxomethyl]-3a,4,5,9b-tetrahydro-3H-cyclopenta[c]quinoline-4-carboxylic acid cid_2930528
TypeSmall organic molecule
Emp. Form.C22H19NO6
Mol. Mass.393.3894
SMILESCOC(=O)c1ccccc1OC(=O)c1ccc2NC(C3CC=CC3c2c1)C(O)=O