Reaction Details
TargetHeat shock cognate 71 kDa protein
LigandBDBM41997
Substrate/Competitorn/a
Meas. Tech.In Vitro Hsc70 Dose Response Fluorescence Polarization Assay
IC50 117000±7840 nM
Citation PubChem, PC In Vitro Hsc70 Dose Response Fluorescence Polarization Assay PubChem Bioassay(2008)[AID]
 
Heat shock cognate 71 kDa protein
Name:Heat shock cognate 71 kDa protein
Type:Enzyme Catalytic Domain
Mol. Mass.:70887.67
Organism:Homo sapiens (Human)
Description:gi_5729877
Residue:646
BDBM41997
NameBDBM41997
Synonyms:6-methyl-8-nitro-3a,4,5,9b-tetrahydro-3H-cyclopenta[c]quinoline-4-carboxylic acid cid_3283315
TypeSmall organic molecule
Emp. Form.C14H14N2O4
Mol. Mass.274.272
SMILESCc1cc(cc2C3C=CCC3C(Nc12)C(O)=O)[N+]([O-])=O