Reaction Details
TargetHeat shock cognate 71 kDa protein
LigandBDBM31757
Substrate/Competitorn/a
Meas. Tech.In Vitro Hsc70 Dose Response Fluorescence Polarization Assay
IC50 62000±5070 nM
Citation PubChem, PC In Vitro Hsc70 Dose Response Fluorescence Polarization Assay PubChem Bioassay(2008)[AID]
 
Heat shock cognate 71 kDa protein
Name:Heat shock cognate 71 kDa protein
Type:Enzyme Catalytic Domain
Mol. Mass.:70887.67
Organism:Homo sapiens (Human)
Description:gi_5729877
Residue:646
BDBM31757
NameBDBM31757
Synonyms:6-hydroxy-3a,4,5,9b-tetrahydro-3H-cyclopenta[c]quinoline-4-carboxylic acid MLS-0015717.0001 | cid_654089
TypeSmall organic molecule
Emp. Form.C13H13NO3
Mol. Mass.231.2472
SMILESOC(=O)C1Nc2c(O)cccc2C2C=CCC12