Reaction Details
TargetHeat shock cognate 71 kDa protein
LigandBDBM50246208
Substrate/Competitorn/a
Meas. Tech.In Vitro Hsc70 Dose Response Fluorescence Polarization Assay
IC50 42400±1740 nM
Citation PubChem, PC In Vitro Hsc70 Dose Response Fluorescence Polarization Assay PubChem Bioassay(2008)[AID]
 
Heat shock cognate 71 kDa protein
Name:Heat shock cognate 71 kDa protein
Type:Enzyme Catalytic Domain
Mol. Mass.:70887.67
Organism:Homo sapiens (Human)
Description:gi_5729877
Residue:646
BDBM50246208
NameBDBM50246208
Synonyms:2-(3,4,5-trihydroxy-6-oxo-6H-xanthen-9-yl)cyclohexanecarboxylic acid cid_274122
TypeSmall organic molecule
Emp. Form.C20H18O7
Mol. Mass.370.3527
SMILESOC(=O)C1CCCCC1c1c2ccc(O)c(O)c2oc2c(O)c(=O)ccc12