Reaction Details
TargetHeat shock cognate 71 kDa protein
LigandBDBM50013703
Substrate/Competitorn/a
Meas. Tech.In Vitro Hsc70 Dose Response Fluorescence Polarization Assay
IC50 280±51 nM
Citation PubChem, PC In Vitro Hsc70 Dose Response Fluorescence Polarization Assay PubChem Bioassay(2008)[AID]
 
Heat shock cognate 71 kDa protein
Name:Heat shock cognate 71 kDa protein
Type:Enzyme Catalytic Domain
Mol. Mass.:70887.67
Organism:Homo sapiens (Human)
Description:gi_5729877
Residue:646
BDBM50013703
NameBDBM50013703
Synonyms:(ADP)[5-(6-amino-9H-purin-9-yl)-3,4-dihydroxytetrahydrofuran-2-yl]methyl trihydrogen diphosphate Adenosine diphosphate CHEMBL14830 cid_16654696 | diPhosphoric acid [5-(6-amino-purin-9-yl)-3,4-dihydroxy-tetrahydro-furan-2-ylmethyl] ester
TypeSmall organic molecule
Emp. Form.C10H15N5O10P2
Mol. Mass.427.2011
SMILESNc1ncnc2n(cnc12)C1OC(COP(O)(=O)OP(O)(O)=O)C(O)C1O