Reaction Details
TargetEstrogen receptor beta
LigandBDBM40490
Substrate/Competitorn/a
Meas. Tech.Estrogen Receptor (beta) binding: Dose Response of Primary Screen Assay
EC50 38.15±n/a nM
Citation PubChem, PC Estrogen Receptor (beta) binding: Dose Response of Primary Screen Assay PubChem Bioassay(2008)[AID]
 
Estrogen receptor beta
Name:Estrogen receptor beta
Type:Protein
Mol. Mass.:59238.43
Organism:Homo sapiens (Human)
Description:Q92731
Residue:530
BDBM40490
NameBDBM40490
Synonyms:(8R,9S,13S,14S,17S)-13-methyl-3,17-bis(oxidanyl)-8,9,11,12,14,15,16,17-octahydro-7H-cyclopenta[a]phenanthren-6-one 6-KETOESTRADIOL SMR000059005 | cid_66419
TypeSmall organic molecule
Emp. Form.C18H22O3
Mol. Mass.286.3655
SMILESC[C@]12CC[C@H]3[C@@H](CC(=O)c4cc(O)ccc34)[C@@H]1CC[C@@H]2O