Reaction Details
TargetGlutathione S-transferase Mu 1
LigandBDBM33076
Substrate/Competitorn/a
Meas. Tech.Profiling Assay to determine GST-GSH interactions in multiplex bead-based assays (HPSMTB buffer)
EC50 9090±n/a nM
Citation PubChem, PC Profiling Assay to determine GST-GSH interactions in multiplex bead-based assays (HPSMTB buffer) PubChem Bioassay(2008)[AID]
 
Glutathione S-transferase Mu 1
Name:Glutathione S-transferase Mu 1
Type:PROTEIN
Mol. Mass.:25712.03
Organism:Homo sapiens (Human)
Description:ChEMBL_799596
Residue:218
BDBM33076
NameBDBM33076
Synonyms:2,3-bis(2-furanyl)-6-methoxyquinoxaline 2,3-bis(furan-2-yl)-6-methoxy-quinoxaline 2,3-di-2-furyl-6-methoxyquinoxaline SMR000137313 | cid_762708
TypeSmall organic molecule
Emp. Form.C17H12N2O3
Mol. Mass.292.2888
SMILESCOc1ccc2nc(-c3ccco3)c(nc2c1)-c1ccco1