Reaction Details
TargetGlutathione S-transferase Mu 1
LigandBDBM32281
Substrate/Competitorn/a
Meas. Tech.Profiling Assay to determine GST-GSH interactions in multiplex bead-based assays (HPSMTB buffer)
EC50 4600±n/a nM
Citation PubChem, PC Profiling Assay to determine GST-GSH interactions in multiplex bead-based assays (HPSMTB buffer) PubChem Bioassay(2008)[AID]
 
Glutathione S-transferase Mu 1
Name:Glutathione S-transferase Mu 1
Type:PROTEIN
Mol. Mass.:25712.03
Organism:Homo sapiens (Human)
Description:ChEMBL_799596
Residue:218
BDBM32281
NameBDBM32281
Synonyms:6-(3,4-Dimethoxy-phenyl)-3-furan-2-yl-7H-[1,2,4]triazolo[3,4-b][1,3,4]thiadiazine 6-(3,4-dimethoxyphenyl)-3-(2-furyl)-7H-[1,2,4]triazolo[3,4-b][1,3,4]thiadiazine MLS000557008 cid_937381
TypeSmall organic molecule
Emp. Form.C16H14N4O3S
Mol. Mass.342.372
SMILESCOc1ccc(cc1OC)C1=Nn2c(SC1)nnc2-c1ccco1