Reaction Details
TargetNuclear receptor coactivator 3
LigandBDBM34408
Substrate/Competitorn/a
Meas. Tech.Dose response biochemical High Throughput Screening assay for agonists of the steroid receptor coactivator 3 (SRC-3) recruitment by the peroxisome proliferator-activated receptor gamma (PPARgamma)
EC50>79370±n/a nM
Citation PubChem, PC Dose response biochemical High Throughput Screening assay for agonists of the steroid receptor coactivator 3 (SRC-3) recruitment by the peroxisome proliferator-activated receptor gamma (PPARgamma) PubChem Bioassay(2008)[AID]
 
Nuclear receptor coactivator 3
Name:Nuclear receptor coactivator 3
Type:Enzyme Catalytic Domain
Mol. Mass.:155305.29
Organism:Homo sapiens (Human)
Description:Q9Y6Q9
Residue:1424
BDBM34408
NameBDBM34408
Synonyms:4-amino-3-(4-methylphenyl)-5-[(4-methyl-1-piperazinyl)carbonyl]-1,3-thiazole-2(3H)-thione SMR000072496 [4-amino-3-(4-methylphenyl)-2-sulfanylidene-5-thiazolyl]-(4-methyl-1-piperazinyl)methanone [4-azanyl-3-(4-methylphenyl)-2-sulfanylidene-1,3-thiazol-5-yl]-(4-methylpiperazin-1-yl)methanone | cid_889983
TypeSmall organic molecule
Emp. Form.C16H20N4OS2
Mol. Mass.348.486
SMILESCN1CCN(CC1)C(=O)c1sc(=S)n(c1N)-c1ccc(C)cc1