Reaction Details
TargetEukaryotic translation initiation factor 2-alpha kinase 3
LigandBDBM46442
Substrate/Competitorn/a
Meas. Tech.Dose response cell-based high-throughput screening assay to measure PERK inhibition
EC50>55700±n/a nM
Citation PubChem, PC Dose response cell-based high-throughput screening assay to measure PERK inhibition PubChem Bioassay(2009)[AID]
 
Eukaryotic translation initiation factor 2-alpha kinase 3
Name:Eukaryotic translation initiation factor 2-alpha kinase 3
Type:Enzyme
Mol. Mass.:125190.66
Organism:Homo sapiens (Human)
Description:Q9NZJ5
Residue:1116
BDBM46442
NameBDBM46442
Synonyms:2,4,7,8-tetramethyl-1,2,3,4-tetrahydroquinoline;hydrochloride SMR000034826 | cid_6602717
TypeSmall organic molecule
Emp. Form.C13H19N
Mol. Mass.189.2967
SMILESCC1CC(C)c2ccc(C)c(C)c2N1