Reaction Details
TargetEukaryotic translation initiation factor 2-alpha kinase 3
LigandBDBM46443
Substrate/Competitorn/a
Meas. Tech.Dose response cell-based high-throughput screening assay to measure PERK inhibition
EC50>55700±n/a nM
Citation PubChem, PC Dose response cell-based high-throughput screening assay to measure PERK inhibition PubChem Bioassay(2009)[AID]
 
Eukaryotic translation initiation factor 2-alpha kinase 3
Name:Eukaryotic translation initiation factor 2-alpha kinase 3
Type:Enzyme
Mol. Mass.:125190.66
Organism:Homo sapiens (Human)
Description:Q9NZJ5
Residue:1116
BDBM46443
NameBDBM46443
Synonyms:MLS000040436 cid_5389826
TypeSmall organic molecule
Emp. Form.C17H25NO5
Mol. Mass.323.3841
SMILES[H][C@]12O[C@@]3(CN(CCCOC)C(=O)[C@]3([H])C1C(=O)OCCCC)C=C2