Reaction Details
TargetMannose-6-phosphate isomerase
LigandBDBM38361
Substrate/Competitorn/a
Meas. Tech.Confirmation of compounds inhibiting phosphomannose isomerase (PMI) via a fluorescence intensity assay.
IC50>50000±n/a nM
Citation PubChem, PC Confirmation of compounds inhibiting phosphomannose isomerase (PMI) via a fluorescence intensity assay. PubChem Bioassay(2010)[AID]
 
Mannose-6-phosphate isomerase
Name:Mannose-6-phosphate isomerase
Type:PROTEIN
Mol. Mass.:46651.35
Organism:Homo sapiens (Human)
Description:ChEMBL_1448919
Residue:423
BDBM38361
NameBDBM38361
Synonyms:2-(4-pyrrolidin-1-ylsulfonylphenyl)-1,2-benzothiazol-3-one 2-[4-(1-pyrrolidinylsulfonyl)phenyl]-1,2-benzothiazol-3-one SMR000060746 | cid_2325816
TypeSmall organic molecule
Emp. Form.C17H16N2O3S2
Mol. Mass.360.451
SMILESO=c1n(sc2ccccc12)-c1ccc(cc1)S(=O)(=O)N1CCCC1