Reaction Details
TargetMannose-6-phosphate isomerase
LigandBDBM46060
Substrate/Competitorn/a
Meas. Tech.Confirmation of compounds inhibiting phosphomannose isomerase (PMI) via a fluorescence intensity assay.
IC50 985±n/a nM
Citation PubChem, PC Confirmation of compounds inhibiting phosphomannose isomerase (PMI) via a fluorescence intensity assay. PubChem Bioassay(2010)[AID]
 
Mannose-6-phosphate isomerase
Name:Mannose-6-phosphate isomerase
Type:PROTEIN
Mol. Mass.:46651.35
Organism:Homo sapiens (Human)
Description:ChEMBL_1448919
Residue:423
BDBM46060
NameBDBM46060
Synonyms:2-(2,5-dimethylphenyl)-6-fluoranyl-1,2-benzothiazol-3-one 727664-91-7 MLS0315771 | cid_1510389
TypeSmall organic molecule
Emp. Form.C15H12FNOS
Mol. Mass.273.325
SMILESCc1ccc(C)c(c1)-n1sc2cc(F)ccc2c1=O