Reaction Details
TargetMannose-6-phosphate isomerase
LigandBDBM46728
Substrate/Competitorn/a
Meas. Tech.Confirmation of compounds inhibiting phosphomannose isomerase (PMI) via a fluorescence intensity assay.
IC50 1070±n/a nM
Citation PubChem, PC Confirmation of compounds inhibiting phosphomannose isomerase (PMI) via a fluorescence intensity assay. PubChem Bioassay(2010)[AID]
 
Mannose-6-phosphate isomerase
Name:Mannose-6-phosphate isomerase
Type:PROTEIN
Mol. Mass.:46651.35
Organism:Homo sapiens (Human)
Description:ChEMBL_1448919
Residue:423
BDBM46728
NameBDBM46728
Synonyms:(Z)-(4-chlorodithiazol-5-ylidene)-(5-methyl-1,3,4-oxadiazol-2-yl)amine (Z)-4-chloro-N-(5-methyl-1,3,4-oxadiazol-2-yl)-5-dithiazolimine ML096 cid_25199533
TypeSmall organic molecule
Emp. Form.C5H3ClN4OS2
Mol. Mass.234.687
SMILESCc1nnc(\N=c2/ssnc2Cl)o1