Reaction Details
TargetMucolipin-3
LigandBDBM46841
Substrate/Competitorn/a
Meas. Tech.Dose response cell-based high-throughput screening assay for agonists of the transient receptor potential channel ML3 (TRPML3)
EC50>3320±n/a nM
Citation PubChem, PC Dose response cell-based high-throughput screening assay for agonists of the transient receptor potential channel ML3 (TRPML3) PubChem Bioassay(2009)[AID]
 
Mucolipin-3
Name:Mucolipin-3
Type:Enzyme Catalytic Domain
Mol. Mass.:64244.09
Organism:Homo sapiens (Human)
Description:Q8TDD5
Residue:553
BDBM46841
NameBDBM46841
Synonyms:MLS000066666 N-cyclohexyl-4-methoxy-2,3-dimethylbenzenesulfonamide cid_2234313
TypeSmall organic molecule
Emp. Form.C15H23NO3S
Mol. Mass.297.413
SMILESCOc1ccc(c(C)c1C)S(=O)(=O)NC1CCCCC1