Reaction Details
TargetMucolipin-3
LigandBDBM46849
Substrate/Competitorn/a
Meas. Tech.Dose response cell-based high-throughput screening assay for agonists of the transient receptor potential channel ML3 (TRPML3)
EC50>29900±n/a nM
Citation PubChem, PC Dose response cell-based high-throughput screening assay for agonists of the transient receptor potential channel ML3 (TRPML3) PubChem Bioassay(2009)[AID]
 
Mucolipin-3
Name:Mucolipin-3
Type:Enzyme Catalytic Domain
Mol. Mass.:64244.09
Organism:Homo sapiens (Human)
Description:Q8TDD5
Residue:553
BDBM46849
NameBDBM46849
Synonyms:4-(3,5-dimethyl-1-pyrazolyl)-6-methyl-N-(phenylmethyl)-1,3,5-triazin-2-amine MLS000109208 SMR000105154 cid_877206
TypeSmall organic molecule
Emp. Form.C16H18N6
Mol. Mass.294.3543
SMILESCc1cc(C)n(n1)-c1nc(C)nc(NCc2ccccc2)n1