Reaction Details
TargetMucolipin-3
LigandBDBM46856
Substrate/Competitorn/a
Meas. Tech.Dose response cell-based high-throughput screening assay for agonists of the transient receptor potential channel ML3 (TRPML3)
EC50 5620±n/a nM
Citation PubChem, PC Dose response cell-based high-throughput screening assay for agonists of the transient receptor potential channel ML3 (TRPML3) PubChem Bioassay(2009)[AID]
 
Mucolipin-3
Name:Mucolipin-3
Type:Enzyme Catalytic Domain
Mol. Mass.:64244.09
Organism:Homo sapiens (Human)
Description:Q8TDD5
Residue:553
BDBM46856
NameBDBM46856
Synonyms:(1-besylcyclopentyl)sulfonylbenzene SMR000055028 [1-(phenylsulfonyl)cyclopentyl]sulfonylbenzene | cid_1380165
TypeSmall organic molecule
Emp. Form.C17H18O4S2
Mol. Mass.350.452
SMILESO=S(=O)(c1ccccc1)C1(CCCC1)S(=O)(=O)c1ccccc1