Reaction Details
TargetProcathepsin L
LigandBDBM16510
Substrate/Competitorn/a
Meas. Tech.Cathepsin L dose-response testing in the presence of cysteine
IC50<1.62794±0.10206 nM
Citation PubChem, PC Cathepsin L dose-response testing in the presence of cysteine PubChem Bioassay(2009)[AID]
 
Procathepsin L
Name:Procathepsin L
Type:Enzyme
Mol. Mass.:37557.19
Organism:Homo sapiens (Human)
Description:Purchased from Calbiochem (San Diego, CA).
Residue:333
BDBM16510
NameBDBM16510
Synonyms:(2S,3S)-3-[[(1S)-1-(isoamylcarbamoyl)-3-methyl-butyl]carbamoyl]oxirane-2-carboxylic acid (2S,3S)-3-[[(2S)-4-methyl-1-(3-methylbutylamino)-1-oxopentan-2-yl]carbamoyl]oxirane-2-carboxylic acid (2S,3S)-3-{[(1S)-3-methyl-1-[(3-methylbutyl)carbamoyl]butyl]carbamoyl}oxirane-2-carboxylic acid E-64C MLS000028693 cid_123664 | epoxysuccinyl derivative E64c
TypeSmall organic molecule
Emp. Form.C15H26N2O5
Mol. Mass.314.3773
SMILESCC(C)CCNC(=O)[C@H](CC(C)C)NC(=O)[C@H]1O[C@@H]1C(O)=O