Reaction Details
TargetProcathepsin L
LigandBDBM32102
Substrate/Competitorn/a
Meas. Tech.Cathepsin L dose-response testing in the presence of cysteine
IC50>50000±0 nM
Citation PubChem, PC Cathepsin L dose-response testing in the presence of cysteine PubChem Bioassay(2009)[AID]
 
Procathepsin L
Name:Procathepsin L
Type:Enzyme
Mol. Mass.:37557.19
Organism:Homo sapiens (Human)
Description:Purchased from Calbiochem (San Diego, CA).
Residue:333
BDBM32102
NameBDBM32102
Synonyms:1,6-dimethylpyrimido[5,4-e][1,2,4]triazine-5,7(1H,6H)-dione 1,6-dimethylpyrimido[5,4-e][1,2,4]triazine-5,7-quinone SMR000024051 US9738628, Compound PKF118-310 | cid_66541
TypeSmall organic molecule
Emp. Form.C7H7N5O2
Mol. Mass.193.1628
SMILESCn1ncnc2c1nc(=O)n(C)c2=O