Reaction Details
TargetPhosphoethanolamine/phosphocholine phosphatase
LigandBDBM38361
Substrate/Competitorn/a
Meas. Tech.SAR assay for compounds that inhibit PHOSPHO1
IC50 489±n/a nM
Citation PubChem, PC SAR assay for compounds that inhibit PHOSPHO1 PubChem Bioassay(2010)[AID]
 
Phosphoethanolamine/phosphocholine phosphatase
Name:Phosphoethanolamine/phosphocholine phosphatase
Type:Enzyme Catalytic Domain
Mol. Mass.:29718.09
Organism:Homo sapiens (Human)
Description:Q8TCT1
Residue:267
BDBM38361
NameBDBM38361
Synonyms:2-(4-pyrrolidin-1-ylsulfonylphenyl)-1,2-benzothiazol-3-one 2-[4-(1-pyrrolidinylsulfonyl)phenyl]-1,2-benzothiazol-3-one SMR000060746 | cid_2325816
TypeSmall organic molecule
Emp. Form.C17H16N2O3S2
Mol. Mass.360.451
SMILESO=c1n(sc2ccccc12)-c1ccc(cc1)S(=O)(=O)N1CCCC1