Reaction Details
TargetSolute carrier family 12 member 5
LigandBDBM44005
Substrate/Competitorn/a
Meas. Tech.Identification of Novel Modulators of Cl- dependent Transport Process via HTS; Dose-dependent Assay with KCC2
EC50 45.8±n/a nM
Citation PubChem, PC Identification of Novel Modulators of Cl- dependent Transport Process via HTS; Dose-dependent Assay with KCC2 PubChem Bioassay(2009)[AID]
 
Solute carrier family 12 member 5
Name:Solute carrier family 12 member 5
Type:PROTEIN
Mol. Mass.:126185.18
Organism:Homo sapiens (Human)
Description:ChEMBL_828024
Residue:1139
BDBM44005
NameBDBM44005
Synonyms:6,8-Diphenyl-3,4a,7a,8-tetrahydro-pyrrolo[3',4':5,6]thiopyrano[2,3-d]thiazole-2,5,7-trione 6,8-diphenyl-3,4a,7a,8-tetrahydropyrrolo[2,3]thiopyrano[4,5-b]thiazole-2,5,7-trione SMR000145301 | cid_4594436
TypeSmall organic molecule
Emp. Form.C20H14N2O3S2
Mol. Mass.394.467
SMILESOc1c2Sc3[nH]c(=O)sc3C(c2c(O)n1-c1ccccc1)c1ccccc1