Reaction Details
TargetSolute carrier family 12 member 5
LigandBDBM43082
Substrate/Competitorn/a
Meas. Tech.Identification of Novel Modulators of Cl- dependent Transport Process via HTS; Dose-dependent Assay with KCC2
EC50 45500±n/a nM
Citation PubChem, PC Identification of Novel Modulators of Cl- dependent Transport Process via HTS; Dose-dependent Assay with KCC2 PubChem Bioassay(2009)[AID]
 
Solute carrier family 12 member 5
Name:Solute carrier family 12 member 5
Type:PROTEIN
Mol. Mass.:126185.18
Organism:Homo sapiens (Human)
Description:ChEMBL_828024
Residue:1139
BDBM43082
NameBDBM43082
Synonyms:MLS000589154 N-(4-chlorophenyl)-2-[(3-ethyl-4-keto-6,7,8,9-tetrahydropyrimido[4,5-b]quinolin-2-yl)thio]acetamide N-(4-chlorophenyl)-2-[(3-ethyl-4-oxo-6,7,8,9-tetrahydropyrimido[4,5-b]quinolin-2-yl)sulfanyl]acetamide SMR000219771 | cid_2012194
TypeSmall organic molecule
Emp. Form.C21H21ClN4O2S
Mol. Mass.428.935
SMILESCCn1c(SCC(=O)Nc2ccc(Cl)cc2)nc2nc3CCCCc3cc2c1=O