Reaction Details
TargetSolute carrier family 12 member 5
LigandBDBM43882
Substrate/Competitorn/a
Meas. Tech.Identification of Novel Modulators of Cl- dependent Transport Process via HTS; Dose-dependent Assay with KCC2
EC50 156±n/a nM
Citation PubChem, PC Identification of Novel Modulators of Cl- dependent Transport Process via HTS; Dose-dependent Assay with KCC2 PubChem Bioassay(2009)[AID]
 
Solute carrier family 12 member 5
Name:Solute carrier family 12 member 5
Type:PROTEIN
Mol. Mass.:126185.18
Organism:Homo sapiens (Human)
Description:ChEMBL_828024
Residue:1139
BDBM43882
NameBDBM43882
Synonyms:MLS000688132 N-(quinolin-8-ylcarbamothioyl)thiophene-2-carboxamide SMR000284302 | cid_803256
TypeSmall organic molecule
Emp. Form.C15H11N3OS2
Mol. Mass.313.397
SMILESO=C(NC(=S)Nc1cccc2cccnc12)c1cccs1