Reaction Details
TargetSolute carrier family 12 member 5
LigandBDBM44130
Substrate/Competitorn/a
Meas. Tech.Identification of Novel Modulators of Cl- dependent Transport Process via HTS; Dose-dependent Assay with KCC2
EC50 270±n/a nM
Citation PubChem, PC Identification of Novel Modulators of Cl- dependent Transport Process via HTS; Dose-dependent Assay with KCC2 PubChem Bioassay(2009)[AID]
 
Solute carrier family 12 member 5
Name:Solute carrier family 12 member 5
Type:PROTEIN
Mol. Mass.:126185.18
Organism:Homo sapiens (Human)
Description:ChEMBL_828024
Residue:1139
BDBM44130
NameBDBM44130
Synonyms:MLS000674627 N-[2-(4-benzylpiperazino)-2-keto-ethyl]-N-methyl-piazthiole-4-sulfonamide N-methyl-N-[2-oxo-2-[4-(phenylmethyl)-1-piperazinyl]ethyl]-2,1,3-benzothiadiazole-4-sulfonamide Structure possibly contains amino acid derivative which is not supported in current version! | cid_16194394
TypeSmall organic molecule
Emp. Form.C20H23N5O3S2
Mol. Mass.445.558
SMILESCN(CC(=O)N1CCN(Cc2ccccc2)CC1)S(=O)(=O)c1cccc2nsnc12