Reaction Details
TargetRegulator of G-protein signaling 8
LigandBDBM47699
Substrate/Competitorn/a
Meas. Tech.Dose respone, multiplexed high-throughput screen for small molecule regulators of RGS family protein interactions, specifically RGS8-Galphao.
EC50>30000±n/a nM
Citation PubChem, PC Dose respone, multiplexed high-throughput screen for small molecule regulators of RGS family protein interactions, specifically RGS8-Galphao. PubChem Bioassay(2009)[AID]
 
Regulator of G-protein signaling 8
Name:Regulator of G-protein signaling 8
Type:Enzyme Catalytic Domain
Mol. Mass.:20925.80
Organism:Homo sapiens (Human)
Description:gi_74355113
Residue:180
BDBM47699
NameBDBM47699
Synonyms:2-[[4-(2-oxolanylmethylamino)-2-quinazolinyl]amino]phenol;hydrochloride 2-[[4-(tetrahydrofurfurylamino)quinazolin-2-yl]amino]phenol;hydrochloride MLS000026785 cid_6602541
TypeSmall organic molecule
Emp. Form.C19H20N4O2
Mol. Mass.336.3877
SMILESOc1ccccc1Nc1nc(NCC2CCCO2)c2ccccc2n1