Reaction Details
TargetRegulator of G-protein signaling 8
LigandBDBM46608
Substrate/Competitorn/a
Meas. Tech.Dose respone, multiplexed high-throughput screen for small molecule regulators of RGS family protein interactions, specifically RGS8-Galphao.
EC50 2000±n/a nM
Citation PubChem, PC Dose respone, multiplexed high-throughput screen for small molecule regulators of RGS family protein interactions, specifically RGS8-Galphao. PubChem Bioassay(2009)[AID]
 
Regulator of G-protein signaling 8
Name:Regulator of G-protein signaling 8
Type:Enzyme Catalytic Domain
Mol. Mass.:20925.80
Organism:Homo sapiens (Human)
Description:gi_74355113
Residue:180
BDBM46608
NameBDBM46608
Synonyms:(4E)-5-methyl-4-[(3-nitroanilino)methylene]-2-phenyl-2-pyrazoline-3-thione (4E)-5-methyl-4-[(3-nitroanilino)methylidene]-2-phenylpyrazole-3-thione (4Z)-5-methyl-4-[(3-nitroanilino)methylene]-2-phenyl-2-pyrazoline-3-thione cid_6945186
TypeSmall organic molecule
Emp. Form.C17H14N4O2S
Mol. Mass.338.384
SMILESCc1[n-]n(-c2ccccc2)c(=S)c1\C=[NH+]\c1cccc(c1)[N+]([O-])=O