Reaction Details
TargetRegulator of G-protein signaling 8
LigandBDBM47735
Substrate/Competitorn/a
Meas. Tech.Dose respone, multiplexed high-throughput screen for small molecule regulators of RGS family protein interactions, specifically RGS8-Galphao.
EC50 1970±n/a nM
Citation PubChem, PC Dose respone, multiplexed high-throughput screen for small molecule regulators of RGS family protein interactions, specifically RGS8-Galphao. PubChem Bioassay(2009)[AID]
 
Regulator of G-protein signaling 8
Name:Regulator of G-protein signaling 8
Type:Enzyme Catalytic Domain
Mol. Mass.:20925.80
Organism:Homo sapiens (Human)
Description:gi_74355113
Residue:180
BDBM47735
NameBDBM47735
Synonyms:3-chloranyl-N-(3,3-dimethylbutan-2-yl)-6-nitro-1-benzothiophene-2-carboxamide 3-chloro-6-nitro-N-(1,2,2-trimethylpropyl)benzothiophene-2-carboxamide MLS000583265 cid_2971539
TypeSmall organic molecule
Emp. Form.C15H17ClN2O3S
Mol. Mass.340.825
SMILESCC(NC(=O)c1sc2cc(ccc2c1Cl)[N+]([O-])=O)C(C)(C)C