Reaction Details
TargetRegulator of G-protein signaling 8
LigandBDBM47770
Substrate/Competitorn/a
Meas. Tech.Dose respone, multiplexed high-throughput screen for small molecule regulators of RGS family protein interactions, specifically RGS8-Galphao.
EC50 4810±n/a nM
Citation PubChem, PC Dose respone, multiplexed high-throughput screen for small molecule regulators of RGS family protein interactions, specifically RGS8-Galphao. PubChem Bioassay(2009)[AID]
 
Regulator of G-protein signaling 8
Name:Regulator of G-protein signaling 8
Type:Enzyme Catalytic Domain
Mol. Mass.:20925.80
Organism:Homo sapiens (Human)
Description:gi_74355113
Residue:180
BDBM47770
NameBDBM47770
Synonyms:4-[5-[(2,2-dimethyl-4,6-dioxo-1,3-dioxan-5-ylidene)methyl]-2-furanyl]benzenesulfonamide 4-[5-[(4,6-diketo-2,2-dimethyl-1,3-dioxan-5-ylidene)methyl]-2-furyl]benzenesulfonamide MLS000703574 cid_1154580
TypeSmall organic molecule
Emp. Form.C17H15NO7S
Mol. Mass.377.369
SMILES[#6]C1([#6])[#8]-[#6](=O)\[#6](=[#6]/c2ccc(o2)-c2ccc(cc2)S([#7])(=O)=O)-[#6](=O)-[#8]1