Reaction Details
TargetRegulator of G-protein signaling 7
LigandBDBM47705
Substrate/Competitorn/a
Meas. Tech.Dose response, multiplexed high-throughput screen for small molecule regulators of RGS family protein interactions, specifically RGS7-Galphao.
EC50>30000±n/a nM
Citation PubChem, PC Dose response, multiplexed high-throughput screen for small molecule regulators of RGS family protein interactions, specifically RGS7-Galphao. PubChem Bioassay(2009)[AID]
 
Regulator of G-protein signaling 7
Name:Regulator of G-protein signaling 7
Type:Enzyme Catalytic Domain
Mol. Mass.:57675.72
Organism:Homo sapiens (Human)
Description:P49802
Residue:495
BDBM47705
NameBDBM47705
Synonyms:1-[2-(difluoromethoxy)-5-methyl-phenyl]-3-(2,4-dimethoxyphenyl)urea 1-[2-[bis(fluoranyl)methoxy]-5-methyl-phenyl]-3-(2,4-dimethoxyphenyl)urea N-[2-(difluoromethoxy)-5-methylphenyl]-N'-(2,4-dimethoxyphenyl)urea cid_2208379
TypeSmall organic molecule
Emp. Form.C17H18F2N2O4
Mol. Mass.352.3326
SMILESCOc1ccc(NC(=O)Nc2cc(C)ccc2OC(F)F)c(OC)c1