Reaction Details
TargetRegulator of G-protein signaling 7
LigandBDBM47706
Substrate/Competitorn/a
Meas. Tech.Dose response, multiplexed high-throughput screen for small molecule regulators of RGS family protein interactions, specifically RGS7-Galphao.
EC50>30000±n/a nM
Citation PubChem, PC Dose response, multiplexed high-throughput screen for small molecule regulators of RGS family protein interactions, specifically RGS7-Galphao. PubChem Bioassay(2009)[AID]
 
Regulator of G-protein signaling 7
Name:Regulator of G-protein signaling 7
Type:Enzyme Catalytic Domain
Mol. Mass.:57675.72
Organism:Homo sapiens (Human)
Description:P49802
Residue:495
BDBM47706
NameBDBM47706
Synonyms:2-[(4,5-dibenzyl-1,2,4-triazol-3-yl)sulfanyl]-N-(5-methyl-1,3,4-thiadiazol-2-yl)acetamide 2-[(4,5-dibenzyl-4H-1,2,4-triazol-3-yl)thio]-N-(5-methyl-1,3,4-thiadiazol-2-yl)acetamide 2-[[4,5-bis(phenylmethyl)-1,2,4-triazol-3-yl]thio]-N-(5-methyl-1,3,4-thiadiazol-2-yl)acetamide SMR000078897 | cid_1260067
TypeSmall organic molecule
Emp. Form.C21H20N6OS2
Mol. Mass.436.553
SMILESCc1nnc(NC(=O)CSc2nnc(Cc3ccccc3)n2Cc2ccccc2)s1