Reaction Details
TargetRegulator of G-protein signaling 7
LigandBDBM34513
Substrate/Competitorn/a
Meas. Tech.Dose response, multiplexed high-throughput screen for small molecule regulators of RGS family protein interactions, specifically RGS7-Galphao.
EC50 4060±n/a nM
Citation PubChem, PC Dose response, multiplexed high-throughput screen for small molecule regulators of RGS family protein interactions, specifically RGS7-Galphao. PubChem Bioassay(2009)[AID]
 
Regulator of G-protein signaling 7
Name:Regulator of G-protein signaling 7
Type:Enzyme Catalytic Domain
Mol. Mass.:57675.72
Organism:Homo sapiens (Human)
Description:P49802
Residue:495
BDBM34513
NameBDBM34513
Synonyms:MLS000118887 N-[2-(2,5-dimethoxyphenyl)ethyl]-2-(4,6-dimethyl-3-oxidanylidene-[1,2]thiazolo[5,4-b]pyridin-2-yl)ethanamide N-[2-(2,5-dimethoxyphenyl)ethyl]-2-(4,6-dimethyl-3-oxo-[1,2]thiazolo[5,4-b]pyridin-2-yl)acetamide US9011882, Table 1, Compound 15 | cid_5309169
TypeSmall organic molecule
Emp. Form.C20H23N3O4S
Mol. Mass.401.479
SMILESCOc1ccc(OC)c(CCNC(=O)Cn2sc3nc(C)cc(C)c3c2=O)c1