Reaction Details
TargetRegulator of G-protein signaling 7
LigandBDBM47005
Substrate/Competitorn/a
Meas. Tech.Dose response, multiplexed high-throughput screen for small molecule regulators of RGS family protein interactions, specifically RGS7-Galphao.
EC50>30000±n/a nM
Citation PubChem, PC Dose response, multiplexed high-throughput screen for small molecule regulators of RGS family protein interactions, specifically RGS7-Galphao. PubChem Bioassay(2009)[AID]
 
Regulator of G-protein signaling 7
Name:Regulator of G-protein signaling 7
Type:Enzyme Catalytic Domain
Mol. Mass.:57675.72
Organism:Homo sapiens (Human)
Description:P49802
Residue:495
BDBM47005
NameBDBM47005
Synonyms:MLS000114722 N-(2-fluorophenyl)-2-[(5-phenyl-1,3,4-oxadiazol-2-yl)sulfanyl]ethanamide SMR000092058 | cid_891159
TypeSmall organic molecule
Emp. Form.C16H12FN3O2S
Mol. Mass.329.349
SMILESFc1ccccc1NC(=O)CSc1nnc(o1)-c1ccccc1