Reaction Details
TargetRegulator of G-protein signaling 7
LigandBDBM47713
Substrate/Competitorn/a
Meas. Tech.Dose response, multiplexed high-throughput screen for small molecule regulators of RGS family protein interactions, specifically RGS7-Galphao.
EC50>30000±n/a nM
Citation PubChem, PC Dose response, multiplexed high-throughput screen for small molecule regulators of RGS family protein interactions, specifically RGS7-Galphao. PubChem Bioassay(2009)[AID]
 
Regulator of G-protein signaling 7
Name:Regulator of G-protein signaling 7
Type:Enzyme Catalytic Domain
Mol. Mass.:57675.72
Organism:Homo sapiens (Human)
Description:P49802
Residue:495
BDBM47713
NameBDBM47713
Synonyms:MLS000113446 N-(1,5-dimethyl-3-oxo-2-phenyl-4-pyrazolyl)-3,4-dimethoxy-N-methylbenzenesulfonamide N-(3-keto-1,5-dimethyl-2-phenyl-3-pyrazolin-4-yl)-3,4-dimethoxy-N-methyl-benzenesulfonamide cid_1075678
TypeSmall organic molecule
Emp. Form.C20H23N3O5S
Mol. Mass.417.479
SMILESCOc1ccc(cc1OC)S(=O)(=O)N(C)c1c(C)n(C)n(-c2ccccc2)c1=O