Reaction Details
TargetRegulator of G-protein signaling 7
LigandBDBM42425
Substrate/Competitorn/a
Meas. Tech.Dose response, multiplexed high-throughput screen for small molecule regulators of RGS family protein interactions, specifically RGS7-Galphao.
EC50>30000±n/a nM
Citation PubChem, PC Dose response, multiplexed high-throughput screen for small molecule regulators of RGS family protein interactions, specifically RGS7-Galphao. PubChem Bioassay(2009)[AID]
 
Regulator of G-protein signaling 7
Name:Regulator of G-protein signaling 7
Type:Enzyme Catalytic Domain
Mol. Mass.:57675.72
Organism:Homo sapiens (Human)
Description:P49802
Residue:495
BDBM42425
NameBDBM42425
Synonyms:MLS000519757 N-[1-(cyclohexylcarbamoyl)cyclohexyl]-N-(furan-2-ylmethyl)pyrazine-2-carboxamide SMR000130175 | cid_4098324
TypeSmall organic molecule
Emp. Form.C23H30N4O3
Mol. Mass.410.5093
SMILESO=C(NC1CCCCC1)C1(CCCCC1)N(Cc1ccco1)C(=O)c1cnccn1