Reaction Details
TargetRegulator of G-protein signaling 7
LigandBDBM47764
Substrate/Competitorn/a
Meas. Tech.Dose response, multiplexed high-throughput screen for small molecule regulators of RGS family protein interactions, specifically RGS7-Galphao.
EC50>30000±n/a nM
Citation PubChem, PC Dose response, multiplexed high-throughput screen for small molecule regulators of RGS family protein interactions, specifically RGS7-Galphao. PubChem Bioassay(2009)[AID]
 
Regulator of G-protein signaling 7
Name:Regulator of G-protein signaling 7
Type:Enzyme Catalytic Domain
Mol. Mass.:57675.72
Organism:Homo sapiens (Human)
Description:P49802
Residue:495
BDBM47764
NameBDBM47764
Synonyms:(4E)-5-methyl-4-[[3-[[(Z)-(3-methyl-1-phenyl-5-sulfanylidene-4-pyrazolylidene)methyl]amino]propylamino]methylidene]-2-phenyl-3-pyrazolethione (4E)-5-methyl-4-[[3-[[(Z)-(3-methyl-1-phenyl-5-sulfanylidenepyrazol-4-ylidene)methyl]amino]propylamino]methylidene]-2-phenylpyrazole-3-thione 3-methyl-4-{[(3-{[(3-methyl-1-phenyl-5-sulfanyl-1H-pyrazol-4-yl)methylene]amino}propyl)imino]methyl}-1-phenyl-1H-pyrazole-5-thiol SMR000225437 | cid_5581000
TypeSmall organic molecule
Emp. Form.C25H26N6S2
Mol. Mass.474.644
SMILESCc1[nH]n(-c2ccccc2)c(=S)c1C=NCCCN=Cc1c(C)[nH]n(-c2ccccc2)c1=S