Reaction Details
TargetRegulator of G-protein signaling 19
LigandBDBM47693
Substrate/Competitorn/a
Meas. Tech.Dose response, multiplexed high-throughput screen for small molecule regulators of RGS family protein interactions, specifically RGS19-Galphao.
EC50>30000±n/a nM
Citation PubChem, PC Dose response, multiplexed high-throughput screen for small molecule regulators of RGS family protein interactions, specifically RGS19-Galphao. PubChem Bioassay(2009)[AID]
 
Regulator of G-protein signaling 19
Name:Regulator of G-protein signaling 19
Type:Enzyme Catalytic Domain
Mol. Mass.:24631.38
Organism:Homo sapiens (Human)
Description:gi_86990435
Residue:217
BDBM47693
NameBDBM47693
Synonyms:1-[3-(2-Chloro-6-fluoro-benzyl)-3H-[1,2,3]triazolo[4,5-d]pyrimidin-7-yl]-piperidin-4-ol 1-[3-[(2-chloranyl-6-fluoranyl-phenyl)methyl]-[1,2,3]triazolo[4,5-d]pyrimidin-7-yl]piperidin-4-ol 1-[3-[(2-chloro-6-fluorophenyl)methyl]triazolo[4,5-d]pyrimidin-7-yl]piperidin-4-ol SMR000000498 | cid_644683
TypeSmall organic molecule
Emp. Form.C16H16ClFN6O
Mol. Mass.362.789
SMILESOC1CCN(CC1)c1ncnc2n(Cc3c(F)cccc3Cl)nnc12