Reaction Details
TargetRegulator of G-protein signaling 19
LigandBDBM47695
Substrate/Competitorn/a
Meas. Tech.Dose response, multiplexed high-throughput screen for small molecule regulators of RGS family protein interactions, specifically RGS19-Galphao.
EC50>30000±n/a nM
Citation PubChem, PC Dose response, multiplexed high-throughput screen for small molecule regulators of RGS family protein interactions, specifically RGS19-Galphao. PubChem Bioassay(2009)[AID]
 
Regulator of G-protein signaling 19
Name:Regulator of G-protein signaling 19
Type:Enzyme Catalytic Domain
Mol. Mass.:24631.38
Organism:Homo sapiens (Human)
Description:gi_86990435
Residue:217
BDBM47695
NameBDBM47695
Synonyms:2-(N-[2-(1-benzotriazolyl)-1-oxoethyl]-2-methoxyanilino)-N-(2-methylbutan-2-yl)-2-(1-methyl-2-pyrrolyl)acetamide 2-[(2-Benzotriazol-1-yl-acetyl)-(2-methoxy-phenyl)-amino]-N-(1,1-dimethyl-propyl)-2-(1-methyl-1H-pyrrol-2-yl)-acetamide MLS000074185 SMR000004342 | cid_646963
TypeSmall organic molecule
Emp. Form.C27H32N6O3
Mol. Mass.488.5814
SMILESCCC(C)(C)NC(=O)C(N(C(=O)Cn1nnc2ccccc12)c1ccccc1OC)c1cccn1C