Reaction Details
TargetRegulator of G-protein signaling 19
LigandBDBM47698
Substrate/Competitorn/a
Meas. Tech.Dose response, multiplexed high-throughput screen for small molecule regulators of RGS family protein interactions, specifically RGS19-Galphao.
EC50>30000±n/a nM
Citation PubChem, PC Dose response, multiplexed high-throughput screen for small molecule regulators of RGS family protein interactions, specifically RGS19-Galphao. PubChem Bioassay(2009)[AID]
 
Regulator of G-protein signaling 19
Name:Regulator of G-protein signaling 19
Type:Enzyme Catalytic Domain
Mol. Mass.:24631.38
Organism:Homo sapiens (Human)
Description:gi_86990435
Residue:217
BDBM47698
NameBDBM47698
Synonyms:5-tert-butyl-3-[(2-chlorophenyl)methyl]-N-(2-morpholin-4-ylethyl)-[1,2,3]triazolo[4,5-d]pyrimidin-7-amine 5-tert-butyl-3-[(2-chlorophenyl)methyl]-N-[2-(4-morpholinyl)ethyl]-7-triazolo[4,5-d]pyrimidinamine SMR000007885 [5-tert-butyl-3-(2-chlorobenzyl)triazolo[4,5-d]pyrimidin-7-yl]-(2-morpholinoethyl)amine | cid_654918
TypeSmall organic molecule
Emp. Form.C21H28ClN7O
Mol. Mass.429.946
SMILESCC(C)(C)c1nc(NCCN2CCOCC2)c2nnn(Cc3ccccc3Cl)c2n1