Reaction Details
TargetRegulator of G-protein signaling 19
LigandBDBM47701
Substrate/Competitorn/a
Meas. Tech.Dose response, multiplexed high-throughput screen for small molecule regulators of RGS family protein interactions, specifically RGS19-Galphao.
EC50>30000±n/a nM
Citation PubChem, PC Dose response, multiplexed high-throughput screen for small molecule regulators of RGS family protein interactions, specifically RGS19-Galphao. PubChem Bioassay(2009)[AID]
 
Regulator of G-protein signaling 19
Name:Regulator of G-protein signaling 19
Type:Enzyme Catalytic Domain
Mol. Mass.:24631.38
Organism:Homo sapiens (Human)
Description:gi_86990435
Residue:217
BDBM47701
NameBDBM47701
Synonyms:3-(2-hydroxy-3-phenoxypropyl)-5-[oxo-[(phenylmethyl)amino]methyl]-4-imidazolecarboxylic acid methyl ester MLS000082701 cid_665038 methyl 5-(benzylcarbamoyl)-3-(2-hydroxy-3-phenoxypropyl)imidazole-4-carboxylate
TypeSmall organic molecule
Emp. Form.C22H23N3O5
Mol. Mass.409.4351
SMILESCOC(=O)c1c(ncn1CC(O)COc1ccccc1)C(=O)NCc1ccccc1