Reaction Details
TargetRegulator of G-protein signaling 19
LigandBDBM47709
Substrate/Competitorn/a
Meas. Tech.Dose response, multiplexed high-throughput screen for small molecule regulators of RGS family protein interactions, specifically RGS19-Galphao.
EC50>30000±n/a nM
Citation PubChem, PC Dose response, multiplexed high-throughput screen for small molecule regulators of RGS family protein interactions, specifically RGS19-Galphao. PubChem Bioassay(2009)[AID]
 
Regulator of G-protein signaling 19
Name:Regulator of G-protein signaling 19
Type:Enzyme Catalytic Domain
Mol. Mass.:24631.38
Organism:Homo sapiens (Human)
Description:gi_86990435
Residue:217
BDBM47709
NameBDBM47709
Synonyms:9-(2-thienyl)-5,6,7,9-tetrahydro-1H-[1,2,4]triazolo[5,1-b]quinazolin-8-one 9-thiophen-2-yl-5,6,7,9-tetrahydro-1H-[1,2,4]triazolo[5,1-b]quinazolin-8-one SMR000073127 | cid_5711559
TypeSmall organic molecule
Emp. Form.C13H12N4OS
Mol. Mass.272.326
SMILESO=C1CCCC2=Nc3ncnn3C(C12)c1cccs1