Reaction Details
TargetRegulator of G-protein signaling 19
LigandBDBM47710
Substrate/Competitorn/a
Meas. Tech.Dose response, multiplexed high-throughput screen for small molecule regulators of RGS family protein interactions, specifically RGS19-Galphao.
EC50>30000±n/a nM
Citation PubChem, PC Dose response, multiplexed high-throughput screen for small molecule regulators of RGS family protein interactions, specifically RGS19-Galphao. PubChem Bioassay(2009)[AID]
 
Regulator of G-protein signaling 19
Name:Regulator of G-protein signaling 19
Type:Enzyme Catalytic Domain
Mol. Mass.:24631.38
Organism:Homo sapiens (Human)
Description:gi_86990435
Residue:217
BDBM47710
NameBDBM47710
Synonyms:(5-methyl-1,2-oxazol-3-yl)-[4-(2-phenylethyl)piperazin-1-yl]methanone (5-methylisoxazol-3-yl)-(4-phenethylpiperazino)methanone MLS000099809 cid_1247515
TypeSmall organic molecule
Emp. Form.C17H21N3O2
Mol. Mass.299.3675
SMILESCc1cc(no1)C(=O)N1CCN(CCc2ccccc2)CC1