Reaction Details
TargetRegulator of G-protein signaling 19
LigandBDBM34513
Substrate/Competitorn/a
Meas. Tech.Dose response, multiplexed high-throughput screen for small molecule regulators of RGS family protein interactions, specifically RGS19-Galphao.
EC50 1210±n/a nM
Citation PubChem, PC Dose response, multiplexed high-throughput screen for small molecule regulators of RGS family protein interactions, specifically RGS19-Galphao. PubChem Bioassay(2009)[AID]
 
Regulator of G-protein signaling 19
Name:Regulator of G-protein signaling 19
Type:Enzyme Catalytic Domain
Mol. Mass.:24631.38
Organism:Homo sapiens (Human)
Description:gi_86990435
Residue:217
BDBM34513
NameBDBM34513
Synonyms:MLS000118887 N-[2-(2,5-dimethoxyphenyl)ethyl]-2-(4,6-dimethyl-3-oxidanylidene-[1,2]thiazolo[5,4-b]pyridin-2-yl)ethanamide N-[2-(2,5-dimethoxyphenyl)ethyl]-2-(4,6-dimethyl-3-oxo-[1,2]thiazolo[5,4-b]pyridin-2-yl)acetamide US9011882, Table 1, Compound 15 | cid_5309169
TypeSmall organic molecule
Emp. Form.C20H23N3O4S
Mol. Mass.401.479
SMILESCOc1ccc(OC)c(CCNC(=O)Cn2sc3nc(C)cc(C)c3c2=O)c1