Reaction Details
TargetRegulator of G-protein signaling 19
LigandBDBM47720
Substrate/Competitorn/a
Meas. Tech.Dose response, multiplexed high-throughput screen for small molecule regulators of RGS family protein interactions, specifically RGS19-Galphao.
EC50>30000±n/a nM
Citation PubChem, PC Dose response, multiplexed high-throughput screen for small molecule regulators of RGS family protein interactions, specifically RGS19-Galphao. PubChem Bioassay(2009)[AID]
 
Regulator of G-protein signaling 19
Name:Regulator of G-protein signaling 19
Type:Enzyme Catalytic Domain
Mol. Mass.:24631.38
Organism:Homo sapiens (Human)
Description:gi_86990435
Residue:217
BDBM47720
NameBDBM47720
Synonyms:2-N,2-N-diethyl-4-N,4-N-diphenyl-1,3,5-triazine-2,4,6-triamine N2,N2-diethyl-N4,N4-diphenyl-1,3,5-triazine-2,4,6-triamine [4-amino-6-(diethylamino)-s-triazin-2-yl]-diphenyl-amine | cid_712290
TypeSmall organic molecule
Emp. Form.C19H22N6
Mol. Mass.334.4182
SMILESCCN(CC)c1nc(N)nc(n1)N(c1ccccc1)c1ccccc1