Reaction Details
TargetRegulator of G-protein signaling 16
LigandBDBM47696
Substrate/Competitorn/a
Meas. Tech.Dose respone, multiplexed high-throughput screen for small molecule regulators of RGS family protein interactions, specifically RGS16-Galphao.
EC50 6560±n/a nM
Citation PubChem, PC Dose respone, multiplexed high-throughput screen for small molecule regulators of RGS family protein interactions, specifically RGS16-Galphao. PubChem Bioassay(2009)[AID]
 
Regulator of G-protein signaling 16
Name:Regulator of G-protein signaling 16
Type:Enzyme Catalytic Domain
Mol. Mass.:22748.87
Organism:Homo sapiens (Human)
Description:gi_156416009
Residue:202
BDBM47696
NameBDBM47696
Synonyms:4-[(3-carbamoyl-4,5-dimethyl-2-thienyl)amino]-4-keto-butyric acid methyl ester MLS000075656 SMR000012612 methyl 4-[(3-aminocarbonyl-4,5-dimethyl-thiophen-2-yl)amino]-4-oxidanylidene-butanoate | methyl 4-[(3-carbamoyl-4,5-dimethylthiophen-2-yl)amino]-4-oxobutanoate
TypeSmall organic molecule
Emp. Form.C12H16N2O4S
Mol. Mass.284.331
SMILESCOC(=O)CCC(=O)Nc1sc(C)c(C)c1C(N)=O