Reaction Details
TargetRegulator of G-protein signaling 16
LigandBDBM34340
Substrate/Competitorn/a
Meas. Tech.Dose respone, multiplexed high-throughput screen for small molecule regulators of RGS family protein interactions, specifically RGS16-Galphao.
EC50 2000±n/a nM
Citation PubChem, PC Dose respone, multiplexed high-throughput screen for small molecule regulators of RGS family protein interactions, specifically RGS16-Galphao. PubChem Bioassay(2009)[AID]
 
Regulator of G-protein signaling 16
Name:Regulator of G-protein signaling 16
Type:Enzyme Catalytic Domain
Mol. Mass.:22748.87
Organism:Homo sapiens (Human)
Description:gi_156416009
Residue:202
BDBM34340
NameBDBM34340
Synonyms:2-(4-methyl-3-piperidin-1-ylsulfonyl-phenyl)-1,2-benzothiazol-3-one 2-(4-methyl-3-piperidinosulfonyl-phenyl)-1,2-benzothiazol-3-one MLS000057572 cid_2327953
TypeSmall organic molecule
Emp. Form.C19H20N2O3S2
Mol. Mass.388.504
SMILESCc1ccc(cc1S(=O)(=O)N1CCCCC1)-n1sc2ccccc2c1=O