Reaction Details
TargetRegulator of G-protein signaling 16
LigandBDBM47776
Substrate/Competitorn/a
Meas. Tech.Dose respone, multiplexed high-throughput screen for small molecule regulators of RGS family protein interactions, specifically RGS16-Galphao.
EC50 950±n/a nM
Citation PubChem, PC Dose respone, multiplexed high-throughput screen for small molecule regulators of RGS family protein interactions, specifically RGS16-Galphao. PubChem Bioassay(2009)[AID]
 
Regulator of G-protein signaling 16
Name:Regulator of G-protein signaling 16
Type:Enzyme Catalytic Domain
Mol. Mass.:22748.87
Organism:Homo sapiens (Human)
Description:gi_156416009
Residue:202
BDBM47776
NameBDBM47776
Synonyms:3-chloranyl-N-(3-morpholin-4-ylpropyl)-6-nitro-1-benzothiophene-2-carboxamide 3-chloro-N-(3-morpholinopropyl)-6-nitro-benzothiophene-2-carboxamide MLS000684370 cid_2225472
TypeSmall organic molecule
Emp. Form.C16H18ClN3O4S
Mol. Mass.383.85
SMILES[O-][N+](=O)c1ccc2c(Cl)c(sc2c1)C(=O)NCCCN1CCOCC1