Reaction Details
TargetRegulator of G-protein signaling 16
LigandBDBM47783
Substrate/Competitorn/a
Meas. Tech.Dose respone, multiplexed high-throughput screen for small molecule regulators of RGS family protein interactions, specifically RGS16-Galphao.
EC50>30000±n/a nM
Citation PubChem, PC Dose respone, multiplexed high-throughput screen for small molecule regulators of RGS family protein interactions, specifically RGS16-Galphao. PubChem Bioassay(2009)[AID]
 
Regulator of G-protein signaling 16
Name:Regulator of G-protein signaling 16
Type:Enzyme Catalytic Domain
Mol. Mass.:22748.87
Organism:Homo sapiens (Human)
Description:gi_156416009
Residue:202
BDBM47783
NameBDBM47783
Synonyms:4-[(2-chloranyl-6-fluoranyl-phenyl)methylideneamino]-3-pyridin-3-yl-1H-1,2,4-triazole-5-thione 4-[(2-chloro-6-fluorobenzylidene)amino]-5-(3-pyridinyl)-4H-1,2,4-triazole-3-thiol 4-[(2-chloro-6-fluorophenyl)methylideneamino]-3-pyridin-3-yl-1H-1,2,4-triazole-5-thione SMR000271762 | cid_806179
TypeSmall organic molecule
Emp. Form.C14H9ClFN5S
Mol. Mass.333.771
SMILESFc1cccc(Cl)c1C=Nn1c(n[nH]c1=S)-c1cccnc1