Reaction Details
Target3C-like protease
LigandBDBM31040
Substrate/Competitorn/a
Meas. Tech.QFRET-based dose response biochemical high throughput screening assay to identify inhibitors of the SARS coronavirus 3C-like Protease (3CLPro)
IC50>59640±n/a nM
Citation PubChem, PC QFRET-based dose response biochemical high throughput screening assay to identify inhibitors of the SARS coronavirus 3C-like Protease (3CLPro) PubChem Bioassay(2009)[AID]
 
3C-like protease
Name:3C-like protease
Synonyms:n/a
Type:Enzyme Catalytic Domain
Mol. Mass.:33462.05
Organism:Avian infectious bronchitis virus
Description:gi_73745819
Residue:307
BDBM31040
NameBDBM31040
TypeSmall organic molecule
Emp. Form.C14H13N5O2
Mol. Mass.283.2853
SMILESCCn1nc(nc2c1nc(=O)n(C)c2=O)-c1ccccc1