Reaction Details
Target3C-like protease
LigandBDBM47859
Substrate/Competitorn/a
Meas. Tech.QFRET-based dose response biochemical high throughput screening assay to identify inhibitors of the SARS coronavirus 3C-like Protease (3CLPro)
IC50 9908±n/a nM
Citation PubChem, PC QFRET-based dose response biochemical high throughput screening assay to identify inhibitors of the SARS coronavirus 3C-like Protease (3CLPro) PubChem Bioassay(2009)[AID]
 
3C-like protease
Name:3C-like protease
Synonyms:n/a
Type:Enzyme Catalytic Domain
Mol. Mass.:33462.05
Organism:Avian infectious bronchitis virus
Description:gi_73745819
Residue:307
BDBM47859
NameBDBM47859
TypeSmall organic molecule
Emp. Form.C14H10ClN3O
Mol. Mass.271.702
SMILESClc1ccc(cc1)C(=O)Cn1nnc2ccccc12