Reaction Details
Target3C-like protease
LigandBDBM47870
Substrate/Competitorn/a
Meas. Tech.QFRET-based dose response biochemical high throughput screening assay to identify inhibitors of the SARS coronavirus 3C-like Protease (3CLPro)
IC50 4586±n/a nM
Citation PubChem, PC QFRET-based dose response biochemical high throughput screening assay to identify inhibitors of the SARS coronavirus 3C-like Protease (3CLPro) PubChem Bioassay(2009)[AID]
 
3C-like protease
Name:3C-like protease
Synonyms:n/a
Type:Enzyme Catalytic Domain
Mol. Mass.:33462.05
Organism:Avian infectious bronchitis virus
Description:gi_73745819
Residue:307
BDBM47870
NameBDBM47870
TypeSmall organic molecule
Emp. Form.C14H13ClN2O3
Mol. Mass.292.718
SMILESCc1cc(C(=O)CCl)c(C)n1-c1cccc(c1)[N+]([O-])=O